Home > Return Code > Return Code Is: 401, Reasonphrase: Unauthorized. Nexus

Return Code Is: 401, Reasonphrase: Unauthorized. Nexus

Contents

Does Actifactory can take care of both release and snapshort artifacts? 2. In this case use code curl -u username:password --request PUT --data target/api-1.0-SNAPSHOT.jar http://url/artifactory/libs-snapshot-local/com/myproject/api‌/1.0-SNAPSHOT/api-1.‌0-20160128.114425-1.‌jar instead –TouDick Jul 5 at 11:08 add a comment| up vote 2 down vote just change in settings.xml Changing it to 0.1.0 ("earlier"), or 0.1.2a, or 0.1.3 ("later") results in the error I was dealing with before this one: –aliteralmind Jul 18 '14 at 18:46 [ERROR] Failed at org.apache.maven.artifact.deployer.DefaultArtifactDeployer.deploy(DefaultArtifactDeployer.java:143) at org.apache.maven.plugin.deploy.AbstractDeployMojo.deploy(AbstractDeployMojo.java:167) at org.apache.maven.plugin.deploy.DeployMojo.execute(DeployMojo.java:149) ... 21 more Caused by: org.eclipse.aether.deployment.DeploymentException: Failed to deploy artifacts: Could not transfer artifact com.github.aliteralmind:xbnjava:pom:0.1.2 from/to sonatype-nexus-staging (https://oss.sonatype.org/service/local/staging/deploy/maven2/): Failed to transfer file: https://oss.sonatype.org/service/local/staging/deploy/maven2/com/github/aliteralmind/xbnjava/0.1.2/xbnjava-0.1.2.pom. this contact form

As a result, I've received many questions from users, and a large amount of them is about '401'. Activity All Comments Work Log History Activity Transitions Hide Permalink Robert Scholte added a comment - 10/Sep/13 14:05 If you get a 401, you either tried to access with the wrong I've never used curl before, so I'm at a loss on what to do with this information. at org.apache.maven.lifecycle.internal.MojoExecutor.execute(MojoExecutor.java:216) at org.apache.maven.lifecycle.internal.MojoExecutor.execute(MojoExecutor.java:153) at org.apache.maven.lifecycle.internal.MojoExecutor.execute(MojoExecutor.java:145) at org.apache.maven.lifecycle.internal.LifecycleModuleBuilder.buildProject(LifecycleModuleBuilder.java:116) at org.apache.maven.lifecycle.internal.LifecycleModuleBuilder.buildProject(LifecycleModuleBuilder.java:80) at org.apache.maven.lifecycle.internal.builder.singlethreaded.SingleThreadedBuilder.build(SingleThreadedBuilder.java:51) at org.apache.maven.lifecycle.internal.LifecycleStarter.execute(LifecycleStarter.java:120) at org.apache.maven.DefaultMaven.doExecute(DefaultMaven.java:347) at org.apache.maven.DefaultMaven.execute(DefaultMaven.java:154) at org.apache.maven.cli.MavenCli.execute(MavenCli.java:584) at org.apache.maven.cli.MavenCli.doMain(MavenCli.java:213) at org.apache.maven.cli.MavenCli.main(MavenCli.java:157) at sun.reflect.NativeMethodAccessorImpl.invoke0(Native Method) at sun.reflect.NativeMethodAccessorImpl.invoke(NativeMethodAccessorImpl.java:57) at sun.reflect.DelegatingMethodAccessorImpl.invoke(DelegatingMethodAccessorImpl.java:43)

Return Code Is: 401, Reasonphrase: Unauthorized. Nexus

Is it possible to get a professor position without having had any fellowships in grad school? Return code is: 401 -> [Help 1] org.apache.maven.lifecycle.LifecycleExecutionException: Failed to execute goal org.apache.maven.plugins:maven-deploy-plugin:2.7:deploy (default-deploy) on project pinder: Failed to deploy artifacts: Could not transfer artifact sg.com.pinder:pinder:jar:0.0.1-20131227.084815-1 from/to ServerA2 (http://192.168.1.16:8081/artifactory/libs-snapshot-local): Failed to The SNAPSHOTS repository (as opposed to the releases repository) allows you to overwrite a similarly numbered version, but your version number should have "-SNAPSHOT" at the end of it.

Return code is: 4 01 at org.apache.maven.lifecycle.DefaultLifecycleExecutor.executeGoals(DefaultLifecycleExecutor .java:564) at org.apache.maven.lifecycle.DefaultLifecycleExecutor.executeStandaloneGoal(DefaultLifecycl eExecutor.java:493) at org.apache.maven.lifecycle.DefaultLifecycleExecutor.executeGoal(DefaultLifecycleExecutor. Thanks & Regards Senthil Kumar C Show Senthil Kumar Chandran added a comment - 06/05/12 10:33 AM Got it! Return code is : 401 at org.apache.maven.plugin.deploy.DeployFileMojo.execute(DeployFileMojo.java:243) at org.apache.maven.plugin.DefaultPluginManager.executeMojo(DefaultPluginManager.java:443) at org.apache.maven.lifecycle.DefaultLifecycleExecutor.executeGoals(DefaultLifecycleExecutor .java:539) ... 16 more Caused by: org.apache.maven.artifact.deployer.ArtifactDeploymentException: Error Artifactory Not Authorized , Reasonphrase:unauthorized. Do EU residents need visa to travel to USA?

Same for snapshots. Error Deploying Artifact Failed To Transfer File Return Code Is 401 Now I get this error in Jenkins when using the build promotion plugin to copy the war artifact to the snapshot repo: ERROR: Failed to deploy artifacts: Could not transfer artifact You can check this by running mvn help:effective-settings. More hints I misspelled the password.

Use the latest version of Maven, as there is a known issue regarding 401: MNG-4469 I am using the latest version: [C:\]mvn -version Apache Maven 3.2.2 (45f7c06d68e745d05611f7fd14efb6594181933e; 2014-06-17T09:51:42-04:00) Maven home: C:\applications\programming\apache-maven-3.2.2 Maven Deploy Username Password This has a 'Repository ID' field which was set to the wrong value. asked 2 years ago viewed 46321 times active 1 month ago Linked 3 now getting 401 unauthorized in jenkins when deploying artifact to archiva maven repo 0 Maven - Error code asked 2 years ago viewed 1716 times active 4 months ago Related 4Resolving SNAPSHOT dependencies with timestamps from Ivy1Problem with m2eclipse — unable to download maven artifacts from Archiva — get

Error Deploying Artifact Failed To Transfer File Return Code Is 401

There are hundreds of projects using this great service. http://blog.sonatype.com/2010/11/what-to-do-when-nexus-returns-401/ Help with a logarithm problem What is the most secured SMTP authentication type? Return Code Is: 401, Reasonphrase: Unauthorized. Nexus If you're certain Maven is using the expected password and you're still getting a 401 error then perhaps the password has been changed on the server? Return Code Is 401 Reasonphrase Unauthorized. Artifactory mfs wrote: > > Hello Guys, > > Any clue as to why am i getting the following error on deploying an > artifact on artifactory repo using mvn deploy:deploy-file..it says

Return code is: 401 > at > org.apache.maven.artifact.deployer.DefaultArtifactDeployer.deploy(DefaultArtifactDeployer > .java:94) > at > org.apache.maven.plugin.deploy.DeployFileMojo.execute(DeployFileMojo.java:239) > ... 18 more > Caused by: org.apache.maven.wagon.TransferFailedException: weblink I successfully logged in and out of the sonatype.org website, using the user/pass in settings.xml. You can find more info here As for your second question, I am not sure I understood but just to cover all options , Artifactory can be installed out of the Return code is: 401, ReasonPhrase: Unauthorized. -> [Help 1] According to this sonatype support page: "If you are receiving a 401 it is because maven is sending the wrong login credentials, Error Deploying Artifact Failed To Transfer File Return Code Is 400

I was so focused in the Stack trace that I didn't read the last lines of the build before the Reactor summary and the stack trace: [DEBUG] Using connector AetherRepositoryConnector with Michael Böckling > -----Original Message----- > From: [hidden email] > [mailto:[hidden email]]On > Behalf Of mfs > Sent: Tuesday, August 28, 2007 1:17 AM > To: [hidden email] > Subject: [Artifactory-users] Does Actifactory can take care of both release and snapshort artifacts? >> 2. navigate here Return code is: 401 at org.apache.maven.artifact.deployer.DefaultArtifactDeployer.deploy(DefaultArtifactDeployer .java:94) at org.apache.maven.plugin.deploy.DeployFileMojo.execute(DeployFileMojo.java:239) ... 18 more Caused by: org.apache.maven.wagon.TransferFailedException: Failed to transfer file: http://vbase.xyz.com/artifactory/repo/itext/itext/2.0.4/itext-2.0.4.jar.

I can suggest you copying the respective snippets from repository page in Artifactory: share|improve this answer answered Dec 26 '13 at 19:45 JBaruch 12.6k3265 Hi! Failed To Deploy Artifacts Could Not Transfer Artifact Return Code Is 400 Reasonphrase Bad Request I then updated the settings.xml in Jenkins with that new user. Maven claims it connects to libs-snapshot-local as admin: sing connector WagonRepositoryConnector with priority 0 for http://192.168.1.16:8081/artifactory/libs-snapshot-local as admin But uploads the file as anonymous.

Return code is: 401, ReasonPhrase:Unauthorized.

Understand malware threats, the impact they can have on your business, and how you can protect your company and customers by using code signing. Thanks & Regards Senthil Kumar C Hide Permalink Alberto Corral added a comment - 04/15/13 05:19 PM I'm having this problem also. Checklist item 6. Maven Could Not Transfer Artifact Not Authorized Thanks to everyone for their help.

Platonic Truth and 1st Order Predicate Logic Why shouldn’t I use Unicode characters to simulate typographic styles (such as small caps or script)? To learn more you can watch this screen cast and read more up to date info at these wikis: http://wiki.jfrog.org/confluence/display/RTD/Hudson+Artifactory+Plugin and http://wiki.jfrog.org/confluence/display/RTF/Build+Integration HTH,EliThe Artifactory Team    On Wed, Jan 12, 2011 What should I do now? http://technologyprometheus.com/return-code/vsam-catalog-return-code-is-8-reason-code-is-igg0cleg-42.html Thanks for the support!

What is the structure in which people sit on the elephant called in English? I've been taking a lot from SO recently, so I'm glad that I've been able to help someone else, your question has been the first time someone's accepted my answer! –John Here's the error I'm getting when calling mvn deploy (full logs at the bottom): [INFO] BUILD FAILURE [ERROR] Failed to execute goal org.apache.maven.plugins:maven-deploy-plugin:2.7:deploy (default-deploy) on project xbnjava: Failed to deploy artifacts: If you control the Archiva server, perhaps you should reset your password. –Mark O'Connor Dec 30 '12 at 0:32 I used help:effective-settings and it printed out the settings I

I got this error, can not find out why, could you please help me on this?                    releases         It will tell you which repositoryId it is using: [DEBUG] (f) offline = false [DEBUG] (f) packaging = exe [DEBUG] (f) pomFile = c:\temp\build-test\pom.xml [DEBUG] (f) project = MavenProject: org.apache.maven:standalone-pom:1 @ Return code is: 401, ReasonPhrase: Unauthorized. Output: [INFO] Scanning for projects... [INFO] [INFO] ------------------------------------------------------------------------ [INFO] Building XBN-Java 0.1.3 [INFO] ------------------------------------------------------------------------ [INFO] [INFO] --- build-helper-maven-plugin:1.8:attach-artifact (attach-artifacts) @ xbnjava --- [INFO] [INFO] --- maven-install-plugin:2.4:install (default-install) @ xbnjava --- [INFO]

If you are receiving a 401 it is because maven is sending the wrong login credentials, or no credentials at all. What is so wrong with thinking of real numbers as infinite decimals? How can I set up a password for the 'rm' command? The id matches but mvn uses anonymous... –Eric Han Dec 26 '13 at 17:41 add a comment| 2 Answers 2 active oldest votes up vote 3 down vote accepted Okay, i

Remember, nothing changed in Archiva, the OS, or the project. at org.sonatype.aether.impl.internal.DefaultDeployer.deploy(DefaultDeployer.java:280) at org.sonatype.aether.impl.internal.DefaultDeployer.deploy(DefaultDeployer.java:211) at org.sonatype.aether.impl.internal.DefaultRepositorySystem.deploy(DefaultRepositorySystem.java:443) at org.apache.maven.artifact.deployer.DefaultArtifactDeployer.deploy(DefaultArtifactDeployer.java:137) ... 10 more Caused by: org.sonatype.aether.transfer.ArtifactTransferException: Could not transfer artifact com.blah.data:RestWebServices:war:1.0-20121224.163825-2 from/to archiva.apache.snapshots (http://10.31.31.64:8080/archiva/repository/snapshots): Failed to transfer file: http://10.31.31.64:8080/archiva/repository/snapshots/com/blah/data/RestWebServices/1.0-SNAPSHOT/RestWebServices-1.0-20121224.163825-2.war. I wrote the question :) –aliteralmind Jul 18 '14 at 17:56 Great.. Any ideas would be appreciated.

For example the following pom.xml and settings.xml DO NOT match. Run mvn with -e -X options and check the debug output. I love Pulak's suggestion of using the "help:effective-settings plugin to troubleshoot this problem. How do I typeset a matrix in an inline equation?

I got this error, >> can not find out why, could you please help me on this? >> >> >> >> We run Archiva on the same machine as UberSVN, and our Jenkins sits inside UberSVN as a plugin.